{"text_format":"3","workbook":"xlsx","n_sheets":5,"sheets":["記入要領","男子用申込書(必ず記入要領を確認してください。)","女子用申込書(必ず記入要領を確認してください。)","男子チーム情報","女子チーム情報"],"not_rendered":{"macros":1,"defined_names":5},"read":"whole","date_system":"1900"}

{"sheet":"記入要領","index":0,"n_rows":50,"n_cols":53,"rows_kept":50,"merged":[[0,45,0,46],[0,48,0,49],[0,51,0,52],[1,15,1,42],[2,12,3,12],[2,15,3,17],[2,18,3,24],[2,25,3,30],[2,31,3,34],[2,35,3,36],[2,37,2,42],[3,37,3,42],[4,15,7,17],[4,19,4,24],[4,32,5,34],[4,35,5,42],[5,19,7,31],[6,32,7,34],[6,35,7,42],[8,15,8,17],[8,18,8,23],[8,25,8,26],[8,29,8,34],[8,35,8,42],[9,15,9,17],[9,18,9,23],[9,29,9,34],[9,35,9,39],[9,40,9,41],[10,12,11,13],[10,15,10,17],[10,18,10,23],[10,29,10,34],[10,35,10,42],[11,15,11,16],[11,17,11,20],[11,21,11,22],[11,23,11,27],[11,28,11,30],[11,31,11,33],[11,34,11,36],[11,37,11,39],[11,40,11,42],[12,15,12,16],[12,17,12,20],[12,21,12,22],[12,23,12,27],[12,28,12,29],[12,31,12,32],[12,34,12,35],[12,37,12,38],[12,40,12,42],[13,15,13,16],[13,17,13,20],[13,21,13,22],[13,23,13,27],[13,28,13,29],[13,31,13,32],[13,34,13,35],[13,37,13,38],[13,40,13,42],[14,15,14,16],[14,17,14,20],[14,21,14,22],[14,23,14,27],[14,28,14,29],[14,31,14,32],[14,34,14,35],[14,37,14,38],[14,40,14,42],[15,15,15,16],[15,17,15,20],[15,21,15,22],[15,23,15,27],[15,28,15,29],[15,31,15,32],[15,34,15,35],[15,37,15,38],[15,40,15,42],[16,15,16,16],[16,17,16,20],[16,21,16,22],[16,23,16,27],[16,28,16,29],[16,31,16,32],[16,34,16,35],[16,37,16,38],[16,40,16,42],[17,15,17,16],[17,17,17,20],[17,21,17,22],[17,23,17,27],[17,28,17,29],[17,31,17,32],[17,34,17,35],[17,37,17,38],[17,40,17,42],[18,15,18,16],[18,17,18,20],[18,21,18,22],[18,23,18,27],[18,28,18,29],[18,31,18,32],[18,34,18,35],[18,37,18,38],[18,40,18,42],[19,15,19,16],[19,17,19,20],[19,21,19,22],[19,23,19,27],[19,28,19,29],[19,31,19,32],[19,34,19,35],[19,37,19,38],[19,40,19,42],[20,15,20,16],[20,17,20,20],[20,21,20,22],[20,23,20,27],[20,28,20,29],[20,31,20,32],[20,34,20,35],[20,37,20,38],[20,40,20,42],[21,15,21,16],[21,17,21,20],[21,21,21,22],[21,23,21,27],[21,28,21,29],[21,31,21,32],[21,34,21,35],[21,37,21,38],[21,40,21,42],[22,15,22,16],[22,17,22,20],[22,21,22,22],[22,23,22,27],[22,28,22,29],[22,31,22,32],[22,34,22,35],[22,37,22,38],[22,40,22,42],[23,15,23,16],[23,17,23,20],[23,21,23,22],[23,23,23,27],[23,28,23,29],[23,31,23,32],[23,34,23,35],[23,37,23,38],[23,40,23,42],[24,15,24,42],[25,15,25,42]]}
[{"$nulls":45},"東予",null,null,"中予",null,null,"南予"]
[{"$nulls":15},"２０１９年度　愛媛県中学生バレーボール選手権大会　参加申込書",{"$nulls":29},"番号","郡市",null,"番号","郡市",null,"番号","郡市"]
[{"$nulls":12},75,null,null,"チーム名",null,null,"愛媛県立",{"$nulls":6},"松山・北条",{"$nulls":5},"中学校",{"$nulls":3},"男子",null,"チームの日本協会登録ＩＤ",{"$nulls":7},1,"川之江北",null,48,"拓南",null,96,"大洲南"]
[{"$nulls":37},431771386,{"$nulls":7},2,"川之江南",null,49,"雄新",null,97,"大洲北"]
[{"$nulls":15},"所在地",null,null,"〒","799-2436",{"$nulls":12},"電　話",null,null,"089-994-0230",{"$nulls":9},3,"三島西",null,50,"勝山",null,98,"平野"]
[{"$nulls":19},"松山市河野別府１２",{"$nulls":25},4,"三島南",null,51,"松山東",null,99,"肱東"]
[{"$nulls":32},"ＦＡＸ",null,null,"089-994-0252",{"$nulls":9},5,"三島東",null,52,"道後",null,100,"新谷"]
[{"$nulls":45},6,"土居",null,53,"鴨川",null,101,"大洲東"]
[null,null,"監督氏名","愛媛　太郎","緊急\n連絡先","090-1234-5678",{"$nulls":9},"監　督",null,null,"愛媛　太郎",{"$nulls":6},"㊞",{"$nulls":3},"緊急連絡先\n監督の携帯電話など",{"$nulls":5},"090-1234-5678",{"$nulls":9},7,"新宮",null,54,"内宮",null,102,"長浜"]
[null,null,"コーチ氏名","愛媛　花子","代表\n保護者","松山　花子",{"$nulls":9},"コーチ",null,null,"愛媛　花子",{"$nulls":10},"代表保護者",{"$nulls":5},"松山　花子",{"$nulls":4},"㊞",{"$nulls":4},8,"新居浜東",null,55,"三津浜",null,103,"肱川"]
[null,null,"マネージャー氏名","松山　太郎","マネージャーＩＤ",1234567902,{"$nulls":4},"合同チームは学校名",null,"ＪＯＣ\n推薦の\n△",null,null,"マネー\nジャー",null,null,"松山　太郎",{"$nulls":10},"マネージャーの\n日本協会登録ＩＤ",{"$nulls":5},1234567902,{"$nulls":9},9,"新居浜西",null,56,"高浜",null,104,"河辺"]
[{"$nulls":3},"日本協会登録ID","背番号","選手氏名","学年","身長","指高","最高到達点","備考",{"$nulls":4},"番号",null,"日本協会\n登録ＩＤ",{"$nulls":3},"背番号",null,"選手氏名",{"$nulls":4},"学　年",null,null,"身　長",null,null,"指　高",null,null,"最高到達点",null,null,"備考\n(合同チームは学校名)",{"$nulls":4},10,"新居浜南",null,57,"津田",null,105,"内子"]
[null,null,1,1234567890,"①","松山　一郎",3,181,231,300,"松山",{"$nulls":4},1,null,1234567890,{"$nulls":3},"①",null,"松山　一郎",{"$nulls":4},3,null,"年",181,null,"cm",231,null,"cm",300,null,"cm","松山",{"$nulls":4},11,"新居浜北",null,58,"垣生",null,106,"大瀬"]
[null,null,2,1234567891,2,"松山　二郎",3,180,230,299,"松山",{"$nulls":4},2,null,1234567891,{"$nulls":3},2,null,"松山　二郎",{"$nulls":4},3,null,"年",180,null,"cm",230,null,"cm",299,null,"cm","松山",{"$nulls":4},12,"泉川",null,59,"興居島",null,107,"五十崎"]
[null,null,3,1234567892,3,"松山　三郎",3,179,229,298,"北条",{"$nulls":4},3,null,1234567892,{"$nulls":3},3,null,"松山　三郎",{"$nulls":4},3,null,"年",179,null,"cm",229,null,"cm",298,null,"cm","北条",{"$nulls":4},13,"船木",null,60,"余土",null,108,"小田"]
[null,null,4,1234567893,4,"松山　四郎",3,178,228,297,"北条",{"$nulls":4},4,null,1234567893,{"$nulls":3},4,null,"松山　四郎",{"$nulls":4},3,null,"年",178,null,"cm",228,null,"cm",297,null,"cm","北条",{"$nulls":4},14,"中萩",null,61,"湯山",null,109,"愛宕"]
[null,null,5,1234567894,5,"松山　五郎",3,177,227,296,"松山",{"$nulls":4},5,null,1234567894,{"$nulls":3},5,null,"松山　五郎",{"$nulls":4},3,null,"年",177,null,"cm",227,null,"cm",296,null,"cm","松山",{"$nulls":4},15,"大生院",null,62,"日浦",null,110,"八代"]
[null,null,6,1234567895,6,"松山　六郎",3,176,226,295,"松山",{"$nulls":4},6,null,1234567895,{"$nulls":3},6,null,"松山　六郎",{"$nulls":4},3,null,"年",176,null,"cm",226,null,"cm",295,null,"cm","松山",{"$nulls":4},16,"角野",null,63,"旭",null,111,"松柏"]
[null,null,7,1234567896,7,"松山　七郎",2,175,225,294,"松山",{"$nulls":4},7,null,1234567896,{"$nulls":3},7,null,"松山　七郎",{"$nulls":4},2,null,"年",175,null,"cm",225,null,"cm",294,null,"cm","松山",{"$nulls":4},17,"川東",null,64,"久米",null,112,"真穴"]
[null,null,8,1234567897,8,"松山　八郎",2,174,224,293,"松山",{"$nulls":4},8,null,1234567897,{"$nulls":3},8,null,"松山　八郎",{"$nulls":4},2,null,"年",174,null,"cm",224,null,"cm",293,null,"cm","松山",{"$nulls":4},18,"別子",null,65,"小野",null,113,"双岩"]
{"$rows_left_out":31}
{"sheet":"男子用申込書(必ず記入要領を確認してください。)","index":1,"n_rows":50,"n_cols":53,"rows_kept":50,"merged":[[0,45,0,46],[0,48,0,49],[0,51,0,52],[1,15,1,42],[2,12,3,12],[2,15,3,17],[2,18,3,24],[2,25,3,30],[2,31,3,34],[2,35,3,36],[2,37,2,42],[3,37,3,42],[4,15,7,17],[4,19,4,24],[4,32,5,34],[4,35,5,42],[5,19,7,31],[6,32,7,34],[6,35,7,42],[8,15,8,17],[8,18,8,23],[8,25,8,26],[8,29,8,34],[8,35,8,42],[9,15,9,17],[9,18,9,23],[9,29,9,34],[9,35,9,39],[9,40,9,41],[10,12,11,13],[10,15,10,17],[10,18,10,23],[10,29,10,34],[10,35,10,42],[11,15,11,16],[11,17,11,20],[11,21,11,22],[11,23,11,27],[11,28,11,30],[11,31,11,33],[11,34,11,36],[11,37,11,39],[11,40,11,42],[12,15,12,16],[12,17,12,20],[12,21,12,22],[12,23,12,27],[12,28,12,29],[12,31,12,32],[12,34,12,35],[12,37,12,38],[12,40,12,42],[13,15,13,16],[13,17,13,20],[13,21,13,22],[13,23,13,27],[13,28,13,29],[13,31,13,32],[13,34,13,35],[13,37,13,38],[13,40,13,42],[14,15,14,16],[14,17,14,20],[14,21,14,22],[14,23,14,27],[14,28,14,29],[14,31,14,32],[14,34,14,35],[14,37,14,38],[14,40,14,42],[15,15,15,16],[15,17,15,20],[15,21,15,22],[15,23,15,27],[15,28,15,29],[15,31,15,32],[15,34,15,35],[15,37,15,38],[15,40,15,42],[16,15,16,16],[16,17,16,20],[16,21,16,22],[16,23,16,27],[16,28,16,29],[16,31,16,32],[16,34,16,35],[16,37,16,38],[16,40,16,42],[17,15,17,16],[17,17,17,20],[17,21,17,22],[17,23,17,27],[17,28,17,29],[17,31,17,32],[17,34,17,35],[17,37,17,38],[17,40,17,42],[18,15,18,16],[18,17,18,20],[18,21,18,22],[18,23,18,27],[18,28,18,29],[18,31,18,32],[18,34,18,35],[18,37,18,38],[18,40,18,42],[19,15,19,16],[19,17,19,20],[19,21,19,22],[19,23,19,27],[19,28,19,29],[19,31,19,32],[19,34,19,35],[19,37,19,38],[19,40,19,42],[20,15,20,16],[20,17,20,20],[20,21,20,22],[20,23,20,27],[20,28,20,29],[20,31,20,32],[20,34,20,35],[20,37,20,38],[20,40,20,42],[21,15,21,16],[21,17,21,20],[21,21,21,22],[21,23,21,27],[21,28,21,29],[21,31,21,32],[21,34,21,35],[21,37,21,38],[21,40,21,42],[22,15,22,16],[22,17,22,20],[22,21,22,22],[22,23,22,27],[22,28,22,29],[22,31,22,32],[22,34,22,35],[22,37,22,38],[22,40,22,42],[23,15,23,16],[23,17,23,20],[23,21,23,22],[23,23,23,27],[23,28,23,29],[23,31,23,32],[23,34,23,35],[23,37,23,38],[23,40,23,42],[24,15,24,42],[25,15,25,42]]}
[{"$nulls":45},"東予",null,null,"中予",null,null,"南予"]
[{"$nulls":15},"２０１９年度　愛媛県中学生バレーボール選手権大会　参加申込書",{"$nulls":29},"番号","郡市",null,"番号","郡市",null,"番号","郡市"]
[{"$nulls":12},0,null,null,"チーム名",null,null,{"$f":"IFERROR(IF(VLOOKUP($M$3,男子チーム情報!$A$2:$J$147,3,0)=0,\"\",VLOOKUP($M$3,男子チーム情報!$A$2:$J$147,3,0)),\"\")","v":""},{"$nulls":6},{"$f":"IFERROR(IF(VLOOKUP($M$3,男子チーム情報!$A$2:$J$147,4,0)=0,\"\",VLOOKUP($M$3,男子チーム情報!$A$2:$J$147,4,0)),\"\")","v":""},{"$nulls":5},{"$f":"IFERROR(IF(VLOOKUP($M$3,男子チーム情報!A2:J147,5,0)=0,\"\",VLOOKUP($M$3,男子チーム情報!A2:J147,5,0)),\"\")","v":""},{"$nulls":3},{"$f":"IFERROR(IF(VLOOKUP($M$3,男子チーム情報!A2:J147,6,0)=0,\"\",VLOOKUP($M$3,男子チーム情報!A2:J147,6,0)),\"\")","v":""},null,"チームの日本協会登録ＩＤ",{"$nulls":7},1,"川之江北",null,48,"拓南",null,96,"大洲南"]
[{"$nulls":37},{"$f":"IFERROR(IF(VLOOKUP($M$3,男子チーム情報!$A$2:$J$147,2,0)=0,\"\",VLOOKUP($M$3,男子チーム情報!$A$2:$J$147,2,0)),\"\")","v":""},{"$nulls":7},2,"川之江南",null,49,"雄新",null,97,"大洲北"]
[{"$nulls":15},"所在地",null,null,"〒",{"$f":"IFERROR(IF(VLOOKUP($M$3,男子チーム情報!$A$2:$J$147,7,0)=0,\"\",VLOOKUP($M$3,男子チーム情報!$A$2:$J$147,7,0)),\"\")","v":""},{"$nulls":12},"電　話",null,null,{"$f":"IFERROR(IF(VLOOKUP($M$3,男子チーム情報!$A$2:$J$147,9,0)=0,\"\",VLOOKUP($M$3,男子チーム情報!$A$2:$J$147,9,0)),\"\")","v":""},{"$nulls":9},3,"三島西",null,50,"勝山",null,98,"平野"]
[{"$nulls":19},{"$f":"IFERROR(IF(VLOOKUP($M$3,男子チーム情報!$A$2:$J$147,8,0)=0,\"\",VLOOKUP($M$3,男子チーム情報!$A$2:$J$147,8,0)),\"\")","v":""},{"$nulls":25},4,"三島南",null,51,"松山東",null,99,"肱東"]
[{"$nulls":32},"ＦＡＸ",null,null,{"$f":"IFERROR(IF(VLOOKUP($M$3,男子チーム情報!$A$2:$J$147,10,0)=0,\"\",VLOOKUP($M$3,男子チーム情報!$A$2:$J$147,10,0)),\"\")","v":""},{"$nulls":9},5,"三島東",null,52,"道後",null,100,"新谷"]
[{"$nulls":45},6,"土居",null,53,"鴨川",null,101,"大洲東"]
[null,null,"監督氏名",null,"緊急\n連絡先",{"$nulls":10},"監　督",null,null,{"$f":"IF(D9=0,\"\",D9)","v":""},{"$nulls":6},"㊞",{"$nulls":3},"緊急連絡先\n監督の携帯電話など",{"$nulls":5},{"$f":"IF(F9=0,\"\",F9)","v":""},{"$nulls":9},7,"新宮",null,54,"内宮",null,102,"長浜"]
[null,null,"コーチ氏名",null,"代表\n保護者",{"$nulls":10},"コーチ",null,null,{"$f":"IF(D10=0,\"\",D10)","v":""},{"$nulls":10},"代表保護者",{"$nulls":5},{"$f":"IF(F10=0,\"\",F10)","v":""},{"$nulls":4},"㊞",{"$nulls":4},8,"新居浜東",null,55,"三津浜",null,103,"肱川"]
[null,null,"マネージャー氏名",null,"マネージャーＩＤ",{"$nulls":5},"合同チームは学校名",null,"ＪＯＣ\n推薦の\n△",null,null,"マネー\nジャー",null,null,{"$f":"IF(D11=\"\",\"\",D11)","v":""},{"$nulls":10},"マネージャーの\n日本協会登録ＩＤ",{"$nulls":5},{"$f":"IF(F11=0,\"\",F11)","v":""},{"$nulls":9},9,"新居浜西",null,56,"高浜",null,104,"河辺"]
[{"$nulls":3},"日本協会登録ID","背番号","選手氏名","学年","身長","指高","最高到達点","備考",{"$nulls":4},"番号",null,"日本協会\n登録ＩＤ",{"$nulls":3},"背番号",null,"選手氏名",{"$nulls":4},"学　年",null,null,"身　長",null,null,"指　高",null,null,"最高到達点",null,null,"備考\n(合同チームは学校名)",{"$nulls":4},10,"新居浜南",null,57,"津田",null,105,"内子"]
[null,null,1,{"$nulls":12},1,null,{"$f":" IF(D13=0,\"\",D13)","v":""},{"$nulls":3},{"$f":"IF(E13=0,\"\",E13)","v":""},null,{"$f":"IF(F13=0,\"\",F13)","v":""},{"$nulls":4},{"$f":"IF(G13=0,\"\",G13)","v":""},null,"年",{"$f":"IF(H13=0,\"\",H13)","v":""},null,"cm",{"$f":"IF(I13=0,\"\",I13)","v":""},null,"cm",{"$f":"IF(J13=0,\"\",J13)","v":""},null,"cm",{"$f":"IF(K13=0,\"\",K13)","v":""},{"$nulls":4},11,"新居浜北",null,58,"垣生",null,106,"大瀬"]
[null,null,2,{"$nulls":12},2,null,{"$f":" IF(D14=0,\"\",D14)","v":""},{"$nulls":3},{"$f":"IF(E14=0,\"\",E14)","v":""},null,{"$f":"IF(F14=0,\"\",F14)","v":""},{"$nulls":4},{"$f":"IF(G14=0,\"\",G14)","v":""},null,"年",{"$f":"IF(H14=0,\"\",H14)","v":""},null,"cm",{"$f":"IF(I14=0,\"\",I14)","v":""},null,"cm",{"$f":"IF(J14=0,\"\",J14)","v":""},null,"cm",{"$f":"IF(K14=0,\"\",K14)","v":""},{"$nulls":4},12,"泉川",null,59,"興居島",null,107,"五十崎"]
[null,null,3,{"$nulls":12},3,null,"",{"$nulls":3},"",null,"",{"$nulls":4},"",null,"年","",null,"cm","",null,"cm","",null,"cm","",{"$nulls":4},13,"船木",null,60,"余土",null,108,"小田"]
[null,null,4,{"$nulls":12},4,null,"",{"$nulls":3},"",null,"",{"$nulls":4},"",null,"年","",null,"cm","",null,"cm","",null,"cm","",{"$nulls":4},14,"中萩",null,61,"湯山",null,109,"愛宕"]
[null,null,5,{"$nulls":12},5,null,"",{"$nulls":3},"",null,"",{"$nulls":4},"",null,"年","",null,"cm","",null,"cm","",null,"cm","",{"$nulls":4},15,"大生院",null,62,"日浦",null,110,"八代"]
[null,null,6,{"$nulls":12},6,null,"",{"$nulls":3},"",null,"",{"$nulls":4},"",null,"年","",null,"cm","",null,"cm","",null,"cm","",{"$nulls":4},16,"角野",null,63,"旭",null,111,"松柏"]
[null,null,7,{"$nulls":12},7,null,"",{"$nulls":3},"",null,"",{"$nulls":4},"",null,"年","",null,"cm","",null,"cm","",null,"cm","",{"$nulls":4},17,"川東",null,64,"久米",null,112,"真穴"]
[null,null,8,{"$nulls":12},8,null,"",{"$nulls":3},"",null,"",{"$nulls":4},"",null,"年","",null,"cm","",null,"cm","",null,"cm","",{"$nulls":4},18,"別子",null,65,"小野",null,113,"双岩"]
{"$rows_left_out":31}
{"sheet":"女子用申込書(必ず記入要領を確認してください。)","index":2,"n_rows":50,"n_cols":53,"rows_kept":50,"merged":[[0,45,0,46],[0,48,0,49],[0,51,0,52],[1,15,1,42],[2,12,3,12],[2,15,3,17],[2,18,3,24],[2,25,3,30],[2,31,3,34],[2,35,3,36],[2,37,2,42],[3,37,3,42],[4,15,7,17],[4,19,4,24],[4,32,5,34],[4,35,5,42],[5,19,7,31],[6,32,7,34],[6,35,7,42],[8,15,8,17],[8,18,8,23],[8,25,8,26],[8,29,8,34],[8,35,8,42],[9,15,9,17],[9,18,9,23],[9,29,9,34],[9,35,9,39],[9,40,9,41],[10,12,11,13],[10,15,10,17],[10,18,10,23],[10,29,10,34],[10,35,10,42],[11,15,11,16],[11,17,11,20],[11,21,11,22],[11,23,11,27],[11,28,11,30],[11,31,11,33],[11,34,11,36],[11,37,11,39],[11,40,11,42],[12,15,12,16],[12,17,12,20],[12,21,12,22],[12,23,12,27],[12,28,12,29],[12,31,12,32],[12,34,12,35],[12,37,12,38],[12,40,12,42],[13,15,13,16],[13,17,13,20],[13,21,13,22],[13,23,13,27],[13,28,13,29],[13,31,13,32],[13,34,13,35],[13,37,13,38],[13,40,13,42],[14,15,14,16],[14,17,14,20],[14,21,14,22],[14,23,14,27],[14,28,14,29],[14,31,14,32],[14,34,14,35],[14,37,14,38],[14,40,14,42],[15,15,15,16],[15,17,15,20],[15,21,15,22],[15,23,15,27],[15,28,15,29],[15,31,15,32],[15,34,15,35],[15,37,15,38],[15,40,15,42],[16,15,16,16],[16,17,16,20],[16,21,16,22],[16,23,16,27],[16,28,16,29],[16,31,16,32],[16,34,16,35],[16,37,16,38],[16,40,16,42],[17,15,17,16],[17,17,17,20],[17,21,17,22],[17,23,17,27],[17,28,17,29],[17,31,17,32],[17,34,17,35],[17,37,17,38],[17,40,17,42],[18,15,18,16],[18,17,18,20],[18,21,18,22],[18,23,18,27],[18,28,18,29],[18,31,18,32],[18,34,18,35],[18,37,18,38],[18,40,18,42],[19,15,19,16],[19,17,19,20],[19,21,19,22],[19,23,19,27],[19,28,19,29],[19,31,19,32],[19,34,19,35],[19,37,19,38],[19,40,19,42],[20,15,20,16],[20,17,20,20],[20,21,20,22],[20,23,20,27],[20,28,20,29],[20,31,20,32],[20,34,20,35],[20,37,20,38],[20,40,20,42],[21,15,21,16],[21,17,21,20],[21,21,21,22],[21,23,21,27],[21,28,21,29],[21,31,21,32],[21,34,21,35],[21,37,21,38],[21,40,21,42],[22,15,22,16],[22,17,22,20],[22,21,22,22],[22,23,22,27],[22,28,22,29],[22,31,22,32],[22,34,22,35],[22,37,22,38],[22,40,22,42],[23,15,23,16],[23,17,23,20],[23,21,23,22],[23,23,23,27],[23,28,23,29],[23,31,23,32],[23,34,23,35],[23,37,23,38],[23,40,23,42],[24,15,24,42],[25,15,25,42]]}
[{"$nulls":45},"東予",null,null,"中予",null,null,"南予"]
[{"$nulls":15},"２０１９年度　愛媛県中学生バレーボール選手権大会　参加申込書",{"$nulls":29},"番号","郡市",null,"番号","郡市",null,"番号","郡市"]
[{"$nulls":12},0,null,null,"チーム名",null,null,{"$f":"IFERROR(IF(VLOOKUP($M$3,女子チーム情報!$A$2:$J$147,3,0)=0,\"\",VLOOKUP($M$3,女子チーム情報!$A$2:$J$147,3,0)),\"\")","v":""},{"$nulls":6},{"$f":"IFERROR(IF(VLOOKUP($M$3,女子チーム情報!$A$2:$J$147,4,0)=0,\"\",VLOOKUP($M$3,女子チーム情報!$A$2:$J$147,4,0)),\"\")","v":""},{"$nulls":5},{"$f":"IFERROR(IF(VLOOKUP($M$3,女子チーム情報!A2:J147,5,0)=0,\"\",VLOOKUP($M$3,女子チーム情報!A2:J147,5,0)),\"\")","v":""},{"$nulls":3},{"$f":"IFERROR(IF(VLOOKUP($M$3,女子チーム情報!A2:J147,6,0)=0,\"\",VLOOKUP($M$3,女子チーム情報!A2:J147,6,0)),\"\")","v":""},null,"チームの日本協会登録ＩＤ",{"$nulls":7},1,"川之江北",null,48,"拓南",null,96,"大洲南"]
[{"$nulls":37},{"$f":"IFERROR(IF(VLOOKUP($M$3,女子チーム情報!$A$2:$J$147,2,0)=0,\"\",VLOOKUP($M$3,女子チーム情報!$A$2:$J$147,2,0)),\"\")","v":""},{"$nulls":7},2,"川之江南",null,49,"雄新",null,97,"大洲北"]
[{"$nulls":15},"所在地",null,null,"〒",{"$f":"IFERROR(IF(VLOOKUP($M$3,女子チーム情報!$A$2:$J$147,7,0)=0,\"\",VLOOKUP($M$3,女子チーム情報!$A$2:$J$147,7,0)),\"\")","v":""},{"$nulls":12},"電　話",null,null,{"$f":"IFERROR(IF(VLOOKUP($M$3,女子チーム情報!$A$2:$J$147,9,0)=0,\"\",VLOOKUP($M$3,女子チーム情報!$A$2:$J$147,9,0)),\"\")","v":""},{"$nulls":9},3,"三島西",null,50,"勝山",null,98,"平野"]
[{"$nulls":19},{"$f":"IFERROR(IF(VLOOKUP($M$3,女子チーム情報!$A$2:$J$147,8,0)=0,\"\",VLOOKUP($M$3,女子チーム情報!$A$2:$J$147,8,0)),\"\")","v":""},{"$nulls":25},4,"三島南",null,51,"松山東",null,99,"肱東"]
[{"$nulls":32},"ＦＡＸ",null,null,{"$f":"IFERROR(IF(VLOOKUP($M$3,女子チーム情報!$A$2:$J$147,10,0)=0,\"\",VLOOKUP($M$3,女子チーム情報!$A$2:$J$147,10,0)),\"\")","v":""},{"$nulls":9},5,"三島東",null,52,"道後",null,100,"新谷"]
[{"$nulls":45},6,"土居",null,53,"鴨川",null,101,"大洲東"]
[null,null,"監督氏名",null,"緊急\n連絡先",{"$nulls":10},"監　督",null,null,{"$f":"IF(D9=0,\"\",D9)","v":""},{"$nulls":6},"㊞",{"$nulls":3},"緊急連絡先\n監督の携帯電話など",{"$nulls":5},{"$f":"IF(F9=0,\"\",F9)","v":""},{"$nulls":9},7,"新宮",null,54,"内宮",null,102,"長浜"]
[null,null,"コーチ氏名",null,"代表\n保護者",{"$nulls":10},"コーチ",null,null,{"$f":"IF(D10=0,\"\",D10)","v":""},{"$nulls":10},"代表保護者",{"$nulls":5},{"$f":"IF(F10=0,\"\",F10)","v":""},{"$nulls":4},"㊞",{"$nulls":4},8,"新居浜東",null,55,"三津浜",null,103,"肱川"]
[null,null,"マネージャー氏名",null,"マネージャーＩＤ",{"$nulls":5},"合同チームは学校名",null,"ＪＯＣ\n推薦の\n△",null,null,"マネー\nジャー",null,null,{"$f":"IF(D11=\"\",\"\",D11)","v":""},{"$nulls":10},"マネージャーの\n日本協会登録ＩＤ",{"$nulls":5},{"$f":"IF(F11=0,\"\",F11)","v":""},{"$nulls":9},9,"新居浜西",null,56,"高浜",null,104,"河辺"]
[{"$nulls":3},"日本協会登録ID","背番号","選手氏名","学年","身長","指高","最高到達点","備考",{"$nulls":4},"番号",null,"日本協会\n登録ＩＤ",{"$nulls":3},"背番号",null,"選手氏名",{"$nulls":4},"学　年",null,null,"身　長",null,null,"指　高",null,null,"最高到達点",null,null,"備考\n(合同チームは学校名)",{"$nulls":4},10,"新居浜南",null,57,"津田",null,105,"内子"]
[null,null,1,{"$nulls":12},1,null,{"$f":" IF(D13=0,\"\",D13)","v":""},{"$nulls":3},{"$f":"IF(E13=0,\"\",E13)","v":""},null,{"$f":"IF(F13=0,\"\",F13)","v":""},{"$nulls":4},{"$f":"IF(G13=0,\"\",G13)","v":""},null,"年",{"$f":"IF(H13=0,\"\",H13)","v":""},null,"cm",{"$f":"IF(I13=0,\"\",I13)","v":""},null,"cm",{"$f":"IF(J13=0,\"\",J13)","v":""},null,"cm",{"$f":"IF(K13=0,\"\",K13)","v":""},{"$nulls":4},11,"新居浜北",null,58,"垣生",null,106,"大瀬"]
[null,null,2,{"$nulls":12},2,null,{"$f":" IF(D14=0,\"\",D14)","v":""},{"$nulls":3},{"$f":"IF(E14=0,\"\",E14)","v":""},null,{"$f":"IF(F14=0,\"\",F14)","v":""},{"$nulls":4},{"$f":"IF(G14=0,\"\",G14)","v":""},null,"年",{"$f":"IF(H14=0,\"\",H14)","v":""},null,"cm",{"$f":"IF(I14=0,\"\",I14)","v":""},null,"cm",{"$f":"IF(J14=0,\"\",J14)","v":""},null,"cm",{"$f":"IF(K14=0,\"\",K14)","v":""},{"$nulls":4},12,"泉川",null,59,"興居島",null,107,"五十崎"]
[null,null,3,{"$nulls":12},3,null,"",{"$nulls":3},"",null,"",{"$nulls":4},"",null,"年","",null,"cm","",null,"cm","",null,"cm","",{"$nulls":4},13,"船木",null,60,"余土",null,108,"小田"]
[null,null,4,{"$nulls":12},4,null,"",{"$nulls":3},"",null,"",{"$nulls":4},"",null,"年","",null,"cm","",null,"cm","",null,"cm","",{"$nulls":4},14,"中萩",null,61,"湯山",null,109,"愛宕"]
[null,null,5,{"$nulls":12},5,null,"",{"$nulls":3},"",null,"",{"$nulls":4},"",null,"年","",null,"cm","",null,"cm","",null,"cm","",{"$nulls":4},15,"大生院",null,62,"日浦",null,110,"八代"]
[null,null,6,{"$nulls":12},6,null,"",{"$nulls":3},"",null,"",{"$nulls":4},"",null,"年","",null,"cm","",null,"cm","",null,"cm","",{"$nulls":4},16,"角野",null,63,"旭",null,111,"松柏"]
[null,null,7,{"$nulls":12},7,null,"",{"$nulls":3},"",null,"",{"$nulls":4},"",null,"年","",null,"cm","",null,"cm","",null,"cm","",{"$nulls":4},17,"川東",null,64,"久米",null,112,"真穴"]
[null,null,8,{"$nulls":12},8,null,"",{"$nulls":3},"",null,"",{"$nulls":4},"",null,"年","",null,"cm","",null,"cm","",null,"cm","",{"$nulls":4},18,"別子",null,65,"小野",null,113,"双岩"]
{"$rows_left_out":31}
{"sheet":"男子チーム情報","index":3,"n_rows":140,"n_cols":19,"rows_kept":140,"hidden":true}
[1,2,3,4,5,6,7,8,9,10]
["番号","チームＩＤ","郡市","学校名","中学校","男女","学校郵便番号","住所","電話","ＦＡＸ",null,"男子ＩＤ","No","通称",null,null,"女子ＩＤ","No","通称"]
[1,433653292,"四国中央市立","川之江北","中学校","男子","７９９－０１０１","四国中央市川之江町２３９０","０８９６－２８－６２８７","０８９６－２８－６１９８",null,433653292,1,"川之江北",null,null,432243313,1,"川之江北"]
[2,432199997,"四国中央市立","川之江南","中学校","男子","７９９－０１２１","四国中央市上分町３９５","０８９６－２８－６２８６","０８９６－２８－６１９７",null,432199997,2,"川之江南",null,null,433260802,2,"川之江南"]
[3,"","四国中央市立","三島西","中学校","男子","７９９－０４２２","四国中央市中之庄町乙３８－１","０８９６－２８－６１００","０８９６－２８－６１２２",null,null,3,"三島西",null,null,432675620,3,"三島西"]
[4,433656247,"四国中央市立","三島南","中学校","男子","７９９－０４３１","四国中央市寒川町４３３５","０８９６－２８－６０９９","０８９６－２８－６１２１",null,433656247,4,"三島南",null,null,432147905,4,"三島南"]
[5,432679932,"四国中央市立","三島東","中学校","男子","７９９－０４１３","四国中央市中曽根町１９９","０８９６－２８－６０９８","０８９６－２８－６１２０",null,432679932,5,"三島東",null,null,432679805,5,"三島東"]
[6,432672200,"四国中央市立","土居","中学校","男子","７９９－０７１１","四国中央市土居町土居３７５","０８９６－２８－６３７１","０８９６－２８－６３８５",null,432672200,6,"土居",null,null,432344247,6,"土居"]
[7,432788969,"四国中央市立","新宮","中学校","男子","７９９－０３０３","四国中央市新宮町新宮１０５","０８９６－２８－６４２４","０８９６－２８－６４２５",null,432788969,7,"新宮",{"$nulls":3},7,"新宮"]
[8,434996017,"新居浜市立","東","中学校","男子","７９２－０８６４","新居浜市東雲町１丁目４番２３号","０８９７－３７－１２９４","０８９７－３７－１０３８",null,434996017,8,"新居浜東",null,null,435655301,8,"新居浜東"]
[9,"","新居浜市立","西","中学校","男子","７９２－０００５","新居浜市江口町７番１号","０８９７－３７－２０２１","０８９７－３７－２０２３",null,null,9,"新居浜西",null,null,433745808,9,"新居浜西"]
[10,432662459,"新居浜市立","南","中学校","男子","７９２－０８１１","新居浜市庄内町２丁目４番４７号","０８９７－３７－０３１０","０８９７－３７－５３９２",null,432662459,10,"新居浜南",null,null,434963270,10,"新居浜南"]
[11,"","新居浜市立","北","中学校","男子","７９２－００２４","新居浜市宮西町５番８１号","０８９７－３３－９１３５","０８９７－３３－９１３６",null,null,11,"新居浜北",null,null,435655004,11,"新居浜北"]
[12,"","新居浜市立","泉川","中学校","男子","７９２－０８２５","新居浜市星原町７番８号","０８９７－４３－５８００","０８９７－４３－５８２１",null,null,12,"泉川",null,null,434333979,12,"泉川"]
[13,"","新居浜市立","船木","中学校","男子","７９２－０８５６","新居浜市船木３７５４番地の１","０８９７－４１－６３４７","０８９７－４１－６３６４",null,null,13,"船木",null,null,433059824,13,"船木"]
[14,432779268,"新居浜市立","中萩","中学校","男子","７９２－００４５","新居浜市中萩町１３－３１","０８９７－４３－５１３１","０８９７－４３－５１３２",null,432779268,14,"中萩",null,null,433430919,14,"中萩"]
[15,"","新居浜市立","大生院","中学校","男子","７９２－００６０","新居浜市大生院１０７０番地の２","０８９７－４１－６９２７","０８９７－４１－６２２９",null,null,15,"大生院",{"$nulls":3},15,"大生院"]
[16,"","新居浜市立","角野","中学校","男子","７９２－０８３３","新居浜市宮原町１１番５１号","０８９７－４３－６１０８","０８９７－４３－６１０９",null,null,16,"角野",null,null,433431983,16,"角野"]
[17,432360195,"新居浜市立","川東","中学校","男子","７９２－０８８４","新居浜市神郷２丁目４番１号","０８９７－４５－０１８０","０８９７－４５－０１４４",null,432360195,17,"川東",null,null,432375137,17,"川東"]
[18,"","新居浜市立","別子","中学校","男子","７９９－０６５０","新居浜市別子山甲３５８","０８９７－６４－２１１５","０８９７－６４－２３２１",null,null,18,"別子",{"$nulls":3},18,"別子"]
{"$rows_left_out":121}
{"sheet":"女子チーム情報","index":4,"n_rows":140,"n_cols":19,"rows_kept":140,"hidden":true}
[1,2,3,4,5,6,7,8,9,10]
["番号","チームＩＤ","郡市","学校名","中学校","男女","学校郵便番号","住所","電話","ＦＡＸ",null,"男子ＩＤ","No","通称",null,null,"女子ＩＤ","No","通称"]
[1,432243313,"四国中央市立","川之江北","中学校","女子","799-0101","四国中央市川之江町２３９０","0896-28-6287","0896-28-6198",null,433653292,1,"川之江北",null,null,432243313,1,"川之江北"]
[2,433260802,"四国中央市立","川之江南","中学校","女子","799-0121","四国中央市上分町３９５","0896-28-6286","0896-28-6197",null,432199997,2,"川之江南",null,null,433260802,2,"川之江南"]
[3,432675620,"四国中央市立","三島西","中学校","女子","799-0422","四国中央市中之庄町乙３８－１","0896-28-6100","0896-28-6122",null,null,3,"三島西",null,null,432675620,3,"三島西"]
[4,432147905,"四国中央市立","三島南","中学校","女子","799-0431","四国中央市寒川町４３３５","0896-28-6099","0896-28-6121",null,433656247,4,"三島南",null,null,432147905,4,"三島南"]
[5,432679805,"四国中央市立","三島東","中学校","女子","799-0413","四国中央市中曽根町１９９","0896-28-6098","0896-28-6120",null,432679932,5,"三島東",null,null,432679805,5,"三島東"]
[6,432344247,"四国中央市立","土居","中学校","女子","799-0711","四国中央市土居町土居３７５","0896-28-6371","0896-28-6385",null,432672200,6,"土居",null,null,432344247,6,"土居"]
[7,"","四国中央市立","新宮","中学校","女子","799-0303","四国中央市新宮町新宮１０５","0896-28-6424","0896-28-6425",null,432788969,7,"新宮",{"$nulls":3},7,"新宮"]
[8,435655301,"新居浜市立","東","中学校","女子","792-0864","新居浜市東雲町１丁目４番２３号","0897-37-1294","0897-37-1038",null,434996017,8,"新居浜東",null,null,435655301,8,"新居浜東"]
[9,433745808,"新居浜市立","西","中学校","女子","792-0005","新居浜市江口町７番１号","0897-37-2021","0897-37-2023",null,null,9,"新居浜西",null,null,433745808,9,"新居浜西"]
[10,434963270,"新居浜市立","南","中学校","女子","792-0811","新居浜市庄内町２丁目４番４７号","0897-37-0310","0897-37-5392",null,432662459,10,"新居浜南",null,null,434963270,10,"新居浜南"]
[11,435655004,"新居浜市立","北","中学校","女子","792-0024","新居浜市宮西町５番８１号","0897-33-9135","0897-33-9136",null,null,11,"新居浜北",null,null,435655004,11,"新居浜北"]
[12,434333979,"新居浜市立","泉川","中学校","女子","792-0825","新居浜市星原町７番８号","0897-43-5800","0897-43-5821",null,null,12,"泉川",null,null,434333979,12,"泉川"]
[13,433059824,"新居浜市立","船木","中学校","女子","792-0856","新居浜市船木３７５４番地の１","0897-41-6347","0897-41-6364",null,null,13,"船木",null,null,433059824,13,"船木"]
[14,433430919,"新居浜市立","中萩","中学校","女子","792-0045","新居浜市中萩町１３－３１","0897-43-5131","0897-43-5132",null,432779268,14,"中萩",null,null,433430919,14,"中萩"]
[15,"","新居浜市立","大生院","中学校","女子","792-0060","新居浜市大生院１０７０番地の２","0897-41-6927","0897-41-6229",null,null,15,"大生院",{"$nulls":3},15,"大生院"]
[16,433431983,"新居浜市立","角野","中学校","女子","792-0833","新居浜市宮原町１１番５１号","0897-43-6108","0897-43-6109",null,null,16,"角野",null,null,433431983,16,"角野"]
[17,432375137,"新居浜市立","川東","中学校","女子","792-0884","新居浜市神郷２丁目４番１号","0897-45-0180","0897-45-0144",null,432360195,17,"川東",null,null,432375137,17,"川東"]
[18,"","新居浜市立","別子","中学校","女子","799-0650","新居浜市別子山甲３５８","0897-64-2115","0897-64-2321",null,null,18,"別子",{"$nulls":3},18,"別子"]
{"$rows_left_out":120}